{"text_format":"3","workbook":"xlsx","n_sheets":11,"sheets":["法人情報","会員情報","追加登録届","会員取消届","口座変更届","慶弔給付金請求","生活習慣病予防健診補助","事業所変更","会員変更","会員証再発行依頼書","会員証再発行依頼書（一括）"],"not_rendered":{"macros":1,"defined_names":2,"comments":1},"read":"whole","date_system":"1900"}

{"sheet":"法人情報","index":0,"n_rows":8,"n_cols":1,"rows_kept":8}
["企業番号"]
["事業所名"]
["郵便番号"]
["住所"]
["電話番号"]
["ＦＡＸ"]
["代表者"]
["担当者"]

{"sheet":"会員情報","index":1,"n_rows":3,"n_cols":60,"rows_kept":3,"merged":[[0,0,0,17],[0,18,0,59]]}
["基本情報（会員）",{"$nulls":17},"家族情報(1から順番に会員台帳の家族欄に表示されます。)"]
["会員番号","加入状況","氏名","氏名（カナ）","性別","生年月日","入社年月日","退職日","結婚年月日","登録年月日","資格喪失日","給付について(指定年度)","所属先","郵便番号","住所１","住所２","連絡先","メールアドレス","家族名１","家族名カナ１","家族生年月日１","家族備考１","家族性別１","家族続柄１","家族名2","家族名カナ2","家族生年月日2","家族備考2","家族性別2","家族続柄2","家族名3","家族名カナ3","家族生年月日3","家族備考3","家族性別3","家族続柄3","家族名4","家族名カナ4","家族生年月日4","家族備考4","家族性別4","家族続柄4","家族名5","家族名カナ5","家族生年月日5","家族備考5","家族性別5","家族続柄5","家族名6","家族名カナ6","家族生年月日6","家族備考6","家族性別6","家族続柄6","家族名7","家族名カナ7","家族生年月日7","家族備考7","家族性別7","家族続柄7"]
[1,"入会","大阪　太郎","オオサカ　タロウ","男","1974-04-01","1974-04-01",null,null,"1974-04-01"]

{"sheet":"追加登録届","index":2,"n_rows":61,"n_cols":24,"rows_kept":61,"merged":[[1,0,1,24],[3,13,3,24],[5,0,5,19],[7,6,7,14],[9,0,9,20],[11,0,11,19],[13,6,14,12],[14,3,14,4],[16,3,16,4],[16,5,17,23],[18,3,18,4],[18,5,19,23],[20,3,20,4],[20,5,21,23],[22,3,22,4],[22,5,23,19],[22,20,23,23],[25,4,25,19],[26,0,28,3],[26,6,27,12],[26,13,27,19],[26,20,28,24],[27,4,28,4],[28,6,28,19],[29,0,31,3],[29,4,31,4],[29,5,31,5],[29,7,29,8],[29,9,29,10],[29,11,29,12],[29,14,29,15],[29,16,29,17],[29,18,29,19],[29,21,29,22],[29,23,29,24],[30,6,31,8],[30,9,31,10],[30,11,31,12],[30,13,31,15],[30,16,31,17],[30,18,31,19],[30,20,31,22],[30,23,31,24],[32,0,34,3],[32,4,34,4],[32,5,34,5],[32,7,32,8],[32,9,32,10],[32,11,32,12],[32,14,32,15],[32,16,32,17],[32,18,32,19],[32,21,32,22],[32,23,32,24],[33,6,34,8],[33,9,34,10],[33,11,34,12],[33,13,34,15],[33,16,34,17],[33,18,34,19],[33,20,34,22],[33,23,34,24],[35,0,37,3],[35,4,37,4],[35,5,37,5],[35,7,35,8],[35,9,35,10],[35,11,35,12],[35,14,35,15],[35,16,35,17],[35,18,35,19],[35,21,35,22],[35,23,35,24],[36,6,37,8],[36,9,37,10],[36,11,37,12],[36,13,37,15],[36,16,37,17],[36,18,37,19],[36,20,37,22],[36,23,37,24],[38,0,40,3],[38,4,40,4],[38,5,40,5],[38,7,38,8],[38,9,38,10],[38,11,38,12],[38,14,38,15],[38,16,38,17],[38,18,38,19],[38,21,38,22],[38,23,38,24],[39,6,40,8],[39,9,40,10],[39,11,40,12],[39,13,40,15],[39,16,40,17],[39,18,40,19],[39,20,40,22],[39,23,40,24],[41,0,43,3],[41,4,43,4],[41,5,43,5],[41,7,41,8],[41,9,41,10],[41,11,41,12],[41,14,41,15],[41,16,41,17],[41,18,41,19],[41,21,41,22],[41,23,41,24],[42,6,43,8],[42,9,43,10],[42,11,43,12],[42,13,43,15],[42,16,43,17],[42,18,43,19],[42,20,43,22],[42,23,43,24],[44,0,46,3],[44,4,46,4],[44,5,46,5],[44,7,44,8],[44,9,44,10],[44,11,44,12],[44,14,44,15],[44,16,44,17],[44,18,44,19],[44,21,44,22],[44,23,44,24],[45,6,46,8],[45,9,46,10],[45,11,46,12],[45,13,46,15],[45,16,46,17],[45,18,46,19],[45,20,46,22],[45,23,46,24],[47,0,49,3],[47,4,49,4],[47,5,49,5],[47,7,47,8],[47,9,47,10],[47,11,47,12],[47,14,47,15],[47,16,47,17],[47,18,47,19],[47,21,47,22],[47,23,47,24],[48,6,49,8],[48,9,49,10],[48,11,49,12],[48,13,49,15],[48,16,49,17],[48,18,49,19],[48,20,49,22],[48,23,49,24],[50,0,52,3],[50,4,52,4],[50,5,52,5],[50,7,50,8],[50,9,50,10],[50,11,50,12],[50,14,50,15],[50,16,50,17],[50,18,50,19],[50,21,50,22],[50,23,50,24],[51,6,52,8],[51,9,52,10],[51,11,52,12],[51,13,52,15],[51,16,52,17],[51,18,52,19],[51,20,52,22],[51,23,52,24],[53,0,55,3],[53,4,55,4],[53,5,55,5],[53,7,53,8],[53,9,53,10],[53,11,53,12],[53,14,53,15],[53,16,53,17],[53,18,53,19],[53,21,53,22],[53,23,53,24],[54,6,55,8],[54,9,55,10],[54,11,55,12],[54,13,55,15],[54,16,55,17],[54,18,55,19],[54,20,55,22],[54,23,55,24],[56,0,58,3],[56,4,58,4],[56,5,58,5],[56,7,56,8],[56,9,56,10],[56,11,56,12],[56,14,56,15],[56,16,56,17],[56,18,56,19],[56,21,56,22],[56,23,56,24],[57,6,58,8],[57,9,58,10],[57,11,58,12],[57,13,58,15],[57,16,58,17],[57,18,58,19],[57,20,58,22],[57,23,58,24]]}
[]
["追　加　登　録　届"]
[]
[]
[]
["　　　　公益財団法人　　大阪市中小企業勤労者福祉サービスセンター"]
[]
[{"$nulls":6},"　　　　理事長殿"]
[]
["　　　　　　　次の者を会員として追加登録しますので会員台帳を"]
[]
["　　　　　　添えてお届けします。"]
[]
[{"$nulls":6},{"$f":"IFERROR(INDEX(法人情報!$B$1:$B$8,1),0)","v":0}]
["　　　　　　企業番号",null,null,"　企業番号"]
[]
["　　　　　　所在地",null,null,"　所在地",null,{"$f":"IFERROR(INDEX(法人情報!$B$1:$B$8,3)&CHAR(10)&INDEX(法人情報!$B$1:$B$8,4),0)","v":"\n"}]
[]
["　　　　　　電話番号",null,null,"　電話番号",null,{"$f":"IFERROR(INDEX(法人情報!$B$1:$B$8,5),0)","v":0}]
[]
["　　　　　　企業名",null,null,"　企業名",null,{"$f":"IFERROR(INDEX(法人情報!$B$1:$B$8,2),0)","v":0}]
[]
["　　　　　　代表者",null,null,"　代表者",null,{"$f":"IFERROR(INDEX(法人情報!$B$1:$B$8,7),0)","v":0},{"$nulls":14},"㊞"]
[]
[]
[{"$nulls":4},"会　　員　　名　　簿"]
["会員番号",{"$nulls":3},"（フリガナ）","性　別","生年月日",{"$nulls":6},"入社年月日",{"$nulls":6},"登録年月"]
[{"$nulls":4},"氏　　名","○で囲んで"]
[{"$nulls":5},"　ください","大正・昭和・平成を○で囲んでください"]
[{"$nulls":4},{"$f":"IFERROR(VLOOKUP($A30,会員情報!$A$2:$BH$1002,3,FALSE),0)","v":0},{"$f":"IFERROR(VLOOKUP($A30,会員情報!$A$2:$BH$1002,5,FALSE),0)","v":0},null,"年",null,"月",null,"日",null,null,"年",null,"月",null,"日",null,null,"年",null,"月"]
{"$rows_left_out":32}
{"sheet":"会員取消届","index":3,"n_rows":44,"n_cols":11,"rows_kept":44,"merged":[[1,1,1,9],[3,9,3,10],[5,0,5,10],[7,2,7,9],[17,2,18,8],[19,2,20,10],[21,2,22,10],[23,2,24,10],[25,2,26,9],[25,10,26,10],[29,0,30,0],[29,2,30,8],[29,9,30,9],[31,2,31,4],[31,5,31,6],[31,7,31,8],[32,2,32,4],[32,5,32,6],[32,7,32,8],[33,2,33,4],[33,5,33,6],[33,7,33,8],[34,2,34,4],[34,5,34,6],[34,7,34,8],[35,2,35,4],[35,5,35,6],[35,7,35,8],[36,2,36,4],[36,5,36,6],[36,7,36,8],[37,2,37,4],[37,5,37,6],[37,7,37,8],[38,2,38,4],[38,5,38,6],[38,7,38,8],[39,2,39,4],[39,5,39,6],[39,7,39,8],[40,2,40,4],[40,5,40,6],[40,7,40,8]]}
[]
[null,"会　員　取　消　届"]
[]
[]
[]
["　 公益財団法人　大阪市中小企業勤労者福祉サービスセンター"]
[]
[null,null,"理　事　長　殿"]
[]
[null,"　この度次の通り会員の登録を取消しますので会員証"]
[]
[null,"を添えてお届けします。"]
[]
[null,"なお、当該会員者についてのサービスセンターに関する"]
[]
[null,"一切の債務は直ちに返済します。"]
[]
[null,null,{"$f":"IFERROR(INDEX(法人情報!$B$1:$B$8,1),0)","v":0}]
[null,"企業番号"]
[null,null,{"$f":"IFERROR(INDEX(法人情報!$B$1:$B$8,3)&CHAR(10)&INDEX(法人情報!$B$1:$B$8,4),0)","v":"\n"}]
[null,"所在地"]
[null,null,{"$f":"IFERROR(INDEX(法人情報!$B$1:$B$8,5),0)","v":0}]
[null,"電話番号"]
[null,null,{"$f":"IFERROR(INDEX(法人情報!$B$1:$B$8,2),0)","v":0}]
[null,"企業名"]
[null,null,{"$f":"IFERROR(INDEX(法人情報!$B$1:$B$8,7),0)","v":0},{"$nulls":7},"㊞"]
[null,"代表者名"]
[]
[]
["会員番号","フ　リ　ガ　ナ","取消事由発生",{"$nulls":6},"取　消　事　由","カードの添付"]
{"$rows_left_out":15}
{"sheet":"口座変更届","index":4,"n_rows":32,"n_cols":18,"rows_kept":32,"merged":[[1,0,1,21],[4,11,4,20],[7,0,7,21],[9,11,9,15],[12,0,12,21],[14,0,14,21],[16,0,16,21],[18,1,18,4],[18,6,18,13],[20,1,20,4],[20,5,20,19],[22,1,22,4],[22,5,22,16],[24,1,24,4],[24,5,24,19],[26,1,26,4],[26,5,26,16],[28,1,28,4],[28,5,28,19]]}
[]
["預　金　口　座　変　更　届"]
[]
[]
[]
[]
[]
["        公益財団法人　大阪市中小企業勤労者福祉サービスセンター"]
[]
[{"$nulls":11},"理　事　長　殿"]
[]
[]
["　　公益財団法人大阪市中小企業勤労者福祉サービスセンターに支払うべき"]
[]
["　　会費の預金口座を預金口座振替依頼書のとおり変更します。"]
[]
["記"]
[]
[null,"企業番号",{"$nulls":4},{"$f":"IFERROR(INDEX(法人情報!$B$1:$B$8,1),0)","v":0}]
[]
[null,"企　業　名",{"$nulls":3},{"$f":"IFERROR(INDEX(法人情報!$B$1:$B$8,2),0)","v":0}]
[]
[null,"代表者名",{"$nulls":3},{"$f":"IFERROR(INDEX(法人情報!$B$1:$B$8,7),0)","v":0},{"$nulls":11},"㊞"]
[]
[null,"所　在　地",{"$nulls":3},{"$f":"IFERROR(INDEX(法人情報!$B$1:$B$8,3)&CHAR(10)&INDEX(法人情報!$B$1:$B$8,4),0)","v":"\n"}]
[]
[null,"電話番号",{"$nulls":3},{"$f":"IFERROR(INDEX(法人情報!$B$1:$B$8,5),0)","v":0}]
[]
[null,"変　更　日"]
[]
{"$rows_left_out":3}
{"sheet":"慶弔給付金請求","index":5,"n_rows":49,"n_cols":10,"rows_kept":49,"merged":[[0,1,0,6],[0,7,0,9],[2,6,2,7],[2,8,2,9],[3,6,3,7],[3,8,3,9],[5,0,5,2],[5,7,5,9],[6,7,7,8],[9,7,9,9],[11,1,11,2],[11,3,11,4],[11,5,11,9],[12,3,13,4],[12,5,13,5],[12,6,13,9],[14,6,14,9],[15,0,16,0],[15,2,16,2],[15,3,16,4],[15,6,15,7],[15,8,15,9],[16,6,16,9],[17,0,18,0],[17,2,18,2],[17,6,17,8],[18,6,18,8],[19,0,21,0],[19,2,21,2],[19,6,19,8],[20,6,20,8],[21,6,21,7],[22,0,23,0],[22,3,26,4],[22,5,26,5],[22,6,23,8],[22,9,23,9],[24,0,26,0],[24,6,25,8],[24,9,25,9],[26,6,26,9],[27,3,28,4],[27,5,28,5],[27,6,28,9],[29,0,31,0],[29,2,31,2],[29,3,31,4],[29,6,29,7],[29,8,29,9],[30,6,30,9],[31,6,31,9],[32,0,33,0],[32,2,33,2],[32,5,33,5],[32,6,33,9],[34,0,36,0],[34,3,36,4],[34,6,34,8],[35,6,35,9],[36,6,36,9],[39,0,40,1],[39,2,40,5],[41,3,41,5],[41,7,41,8],[42,0,44,1],[42,2,44,5],[46,0,47,1],[46,2,47,4],[46,5,47,5]]}
["　　　　","慶　弔　給　付　金　請　求　書"]
[]
["公益財団法人大阪市中小企業勤労者福祉サービスセンター",{"$nulls":5},"企　業　番　号",null,{"$f":"IFERROR(INDEX(法人情報!$B$1:$B$8,1),0)","v":0}]
[{"$nulls":3},"理事長　殿",null,null,"会　員　番　号"]
[]
[{"$nulls":3},"に下記のとおり給付事由に",null,null,"登録年月日　　　　　年　　　　月　　　　日",{"$f":"IFERROR(VLOOKUP($I$4,会員情報!$A$2:$BH$1020,10,FALSE),0)","v":"00:00:00"}]
[]
["該当したので関係書類を添えて請求します。",{"$nulls":5},"申請者氏名",null,null,"㊞"]
[]
[{"$nulls":6},"昭和・平成　　　　　　　年　　　　　　月　"]
[{"$nulls":4},"記"]
["種　類","金　　　額",null,"添付書類（コピー可）",null,"給　付　事　由　該　当　内　容"]
["二十歳",null,"１０，０００円","不　　要",null,"生年月日"]
["還暦",null,"１０，０００円"]
["卒業",null,"１０，０００円","卒業証明書",null,"学校名"]
["結婚",null,"２０，０００円","不　　要　　　　　　　　　　在会中２回まで",null,"配偶者名"]
[{"$nulls":5},"婚姻届出日"]
["出産",null,"１０，０００円","出生証明書 ・ 母子手帳",null,"子供の名"]
[{"$nulls":3},"１ページ目 (何れか１つ）",null,"生年月日"]
["入学",null,"１０，０００円","就学通知書",null,"子供の名"]
[{"$nulls":3},"在学証明書",null,"生年月日"]
[{"$nulls":3}," ( 何れか１つ ）",null,"学校名",null,null,"学校の種類"]
["永年","１０年","５，０００円","不　　要",null,"勤続期間",{"$nulls":3},"～"]
[null,"１５年","１０，０００円"]
["勤　　続","２０年","１５，０００円",{"$nulls":6},"まで"]
[null,"３０年","２０，０００円"]
[null,"４０年","３０，０００円",{"$nulls":3},{"$f":"DATEDIF(G23,G25,\"Y\")&\"年\"&DATEDIF(G23,G25,\"YM\")&\"ヶ月勤務\"","v":"0年0ヶ月勤務"}]
["銀婚",null,"２０，０００円","戸籍謄抄本",null,"婚姻届出日"]
["金婚",null,"３０，０００円"]
["傷病",null,"１０，０００円","１ヶ月以上就労不能を　　表す医師の診断書",null,"就労不能"]
{"$rows_left_out":20}
{"sheet":"生活習慣病予防健診補助","index":6,"n_rows":57,"n_cols":16,"rows_kept":57,"merged":[[0,3,0,12],[1,2,1,12],[2,12,2,15],[6,6,6,9],[8,9,9,14],[10,4,11,5],[10,9,11,14],[12,9,13,12],[12,13,13,14],[14,9,15,12],[22,0,26,0],[22,1,26,3],[22,4,26,4],[22,5,26,5],[22,6,26,6],[22,8,26,8],[22,9,26,11],[22,12,26,12],[22,13,26,13],[22,14,26,14],[23,7,26,7],[23,15,26,15],[27,1,27,3],[27,9,27,11],[28,1,28,3],[28,9,28,11],[29,1,29,3],[29,9,29,11],[30,1,30,3],[30,9,30,11],[31,1,31,3],[31,9,31,11],[32,1,32,3],[32,9,32,11],[33,1,33,3],[33,9,33,11],[34,1,34,3],[34,9,34,11],[35,1,35,3],[35,9,35,11],[36,1,36,3],[36,9,36,11],[38,4,38,12],[40,1,40,3],[40,4,40,5],[40,7,40,8],[41,4,41,5],[41,7,41,8],[42,4,42,5],[42,7,42,8],[43,5,43,6],[43,7,43,8],[45,0,46,3],[45,4,46,7],[45,8,46,15],[47,0,53,3],[47,4,48,7],[47,8,49,11],[47,12,49,15],[49,4,53,7],[50,8,53,11],[50,12,53,15]]}
[{"$nulls":3},"全国健康保険協会（協会けんぽ）"]
[null,null,"生活習慣病予防健診 補助金請求書"]
[]
[]
[null,null,"公益財団法人　大阪市中小企業勤労者福祉サービスセンター"]
[]
[{"$nulls":6},"理　事　長　殿"]
[]
[{"$nulls":9},{"$f":"IFERROR(INDEX(法人情報!$B$1:$B$8,3)&CHAR(10)&INDEX(法人情報!$B$1:$B$8,4),0)","v":"\n"}]
[{"$nulls":3},"企業番号",{"$nulls":3},"所在地"]
[{"$nulls":4},{"$f":"\"〔\"&IFERROR(INDEX(法人情報!$B$1:$B$8,1),0)&\"〕\"","v":"〔〕"},{"$nulls":4},{"$f":"IFERROR(INDEX(法人情報!$B$1:$B$8,2),0)","v":0}]
[{"$nulls":7},"企業名"]
[{"$nulls":9},{"$f":"IFERROR(INDEX(法人情報!$B$1:$B$8,7),0)","v":0},{"$nulls":3},"㊞"]
[{"$nulls":7},"代表者氏名"]
[]
[{"$nulls":7},"（担当者）"]
[]
[]
[null,null,"次のとおり健診負担金領収書を添え補助金を請求します。　　　",{"$nulls":8},"（","2020-05-26","）"]
[]
[{"$nulls":7},"記"]
[]
["会員\n番号","健診内訳",null,null,"氏　　名","受\n診\n者","受\n診\n日","※","会員\n番号","健診内訳",null,null,"氏　　名","受\n診\n者","受\n診\n日","※"]
[{"$nulls":7},"補助額",{"$nulls":7},"補助額"]
[]
[]
[]
[null,"種類を選択",null,null,{"$f":"IFERROR(VLOOKUP($A28,会員情報!$A$2:$BH$1020,3,FALSE),0)","v":0},"本人",{"$nulls":3},"35歳未満",null,null,{"$f":"IFERROR(VLOOKUP($I28,会員情報!$A$2:$BH$1020,3,FALSE),0)","v":0},"本人"]
[null,"種類を選択",null,null,{"$f":"IFERROR(VLOOKUP($A29,会員情報!$A$2:$BH$1020,3,FALSE),0)","v":0},"本人",{"$nulls":3},"種類を選択",null,null,{"$f":"IFERROR(VLOOKUP($I29,会員情報!$A$2:$BH$1020,3,FALSE),0)","v":0},"本人"]
[null,"種類を選択",null,null,{"$f":"IFERROR(VLOOKUP($A30,会員情報!$A$2:$BH$1020,3,FALSE),0)","v":0},"本人",{"$nulls":3},"種類を選択",null,null,{"$f":"IFERROR(VLOOKUP($I30,会員情報!$A$2:$BH$1020,3,FALSE),0)","v":0},"本人"]
{"$rows_left_out":28}
{"sheet":"事業所変更","index":7,"n_rows":39,"n_cols":13,"rows_kept":39,"merged":[[1,1,1,11],[3,6,3,12],[5,0,5,9],[7,0,7,5],[9,4,9,5],[9,8,9,11],[11,4,11,5],[11,6,12,12],[13,4,13,5],[13,6,14,12],[15,4,15,5],[15,6,16,11],[20,5,20,12],[21,5,21,12],[22,5,22,12],[23,5,23,12],[24,5,24,12],[30,0,30,5],[30,6,30,12],[31,0,32,5],[31,6,32,12],[33,0,34,5],[33,6,34,12],[35,0,36,5],[35,6,36,12]]}
[]
[null,"事　　業　　所　　変　　 更　　 届"]
[]
[]
[]
["　公益財団法人　大阪市中小企業勤労者福祉サービスセンター"]
[]
["理　　事　　長　　殿"]
[]
[{"$nulls":4},"企業番号",{"$nulls":3},{"$f":"IFERROR(INDEX(法人情報!$B$1:$B$8,1),0)","v":0}]
[]
[{"$nulls":4},"所　在　地",null,{"$f":"IFERROR(INDEX(法人情報!$B$1:$B$8,3)&CHAR(10)&INDEX(法人情報!$B$1:$B$8,4),0)","v":"\n"}]
[]
[{"$nulls":4},"事　業　所　名",null,{"$f":"IFERROR(INDEX(法人情報!$B$1:$B$8,2),0)","v":0}]
[]
[{"$nulls":4},"代　表　者",null,{"$f":"IFERROR(INDEX(法人情報!$B$1:$B$8,7),0)","v":0},{"$nulls":5},"㊞"]
[]
[]
["　　次の事項につき変更がありましたので届け出ます。"]
[]
[null,null,"１．事業所名"]
["変",null,"２．所在地"]
["更",null,"３．電話番号・ＦＡＸ"]
["事",null,"４．事業主又は代表者名"]
["項",null,"５．その他"]
[]
[null,"（注意）　※該当事項にチェックを付けてください。"]
[null,null,"※掛け金振替口座の変更は、この用紙ではできません。"]
[null,null,"　　ＯＣＳセンターまでご連絡ください。"]
[]
{"$rows_left_out":10}
{"sheet":"会員変更","index":8,"n_rows":54,"n_cols":41,"rows_kept":54,"merged":[[5,4,7,51],[9,38,10,54],[12,3,12,43],[13,29,13,43],[16,5,19,15],[16,19,19,42],[23,5,24,15],[23,16,24,50],[27,44,28,45],[28,5,29,15],[28,16,29,39],[28,40,29,41],[33,5,34,15],[33,16,34,50],[38,3,39,52],[41,2,42,7],[41,8,42,14],[41,15,42,15],[41,16,42,22],[41,23,42,28],[41,29,42,52],[43,2,43,52],[44,2,44,7],[44,8,44,22],[44,23,44,37],[44,38,44,52],[45,2,46,7],[45,8,46,22],[45,23,46,37],[45,38,46,52],[47,2,48,7],[47,8,48,22],[47,23,48,32],[47,33,48,52]]}
[]
[]
[]
[]
[]
[{"$nulls":4},"会 員 登 録 事 項 変 更 届"]
[]
[]
[]
[]
[]
[]
[{"$nulls":3},"公益財団法人大阪市中小企業勤労者福祉サービスセンター"]
[{"$nulls":29},"理  事  長  殿"]
[]
[]
[{"$nulls":5},"企業番号",{"$nulls":13},{"$f":"IFERROR(INDEX(法人情報!$B$1:$B$8,1),0)","v":0}]
[]
[]
[]
[]
[]
[]
[{"$nulls":5},"企業名",{"$nulls":10},{"$f":"IFERROR(INDEX(法人情報!$B$1:$B$8,2),0)","v":0}]
[]
[]
[]
[]
[{"$nulls":5},"代表者",{"$nulls":10},{"$f":"IFERROR(INDEX(法人情報!$B$1:$B$8,7),0)","v":0},{"$nulls":23},"㊞"]
[]
{"$rows_left_out":25}
{"sheet":"会員証再発行依頼書","index":9,"n_rows":12,"n_cols":4,"rows_kept":12,"merged":[[0,2,0,3],[7,1,7,3],[8,1,8,3]]}
[]
["公益財団法人　大阪市中小企業勤労者福祉サービスセンター　宛　　　"]
["《ＯＣＳカード再発行依頼書》　　"]
[]
["事　業　所　名",{"$f":"IFERROR(INDEX(法人情報!$B$1:$B$8,2),0)","v":0},"会員\n番号"]
["会　　員　　名",{"$f":"IFERROR(VLOOKUP($D$5,会員情報!$A$2:$BH$1020,3,FALSE),0)","v":0},"ＴＥＬ",{"$f":"IFERROR(VLOOKUP($D$5,会員情報!$A$2:$BH$1020,17,FALSE),0)","v":0}]
["メールアドレス",{"$f":"IFERROR(VLOOKUP($D$5,会員情報!$A$2:$BH$1020,18,FALSE),0)","v":0},"送付希望先"]
["送　付　住　所　　",{"$f":"IFERROR(IF(D7=\"自宅\",VLOOKUP($D$5,会員情報!$A$2:$BH$1020,14,FALSE)&CHAR(10)&\nVLOOKUP($D$5,会員情報!$A$2:$BH$1020,15,FALSE)&VLOOKUP($D$5,会員情報!$A$2:$BH$1020,16,FALSE),INDEX(法人情報!$B$1:$B$8,3)&CHAR(10)&INDEX(法人情報!$B$1:$B$8,4)),0)","v":"\n"}]
["再　発　行　理　由","再発行理由を選択してください。"]
["※ＯＣＳセンター事務局までＦＡＸまたは郵送でお申込みください。"]
["【個人情報のお取扱いについて】　"]
["ご提出いただく書類の個人情報は、ＯＣＳセンターが実施する事業及びOCSセンターの事業に関する情報提供に使用させていただきます。"]

{"sheet":"会員証再発行依頼書（一括）","index":10,"n_rows":54,"n_cols":43,"rows_kept":54,"merged":[[4,36,5,54],[11,19,12,30],[11,36,12,47],[14,19,15,30],[14,32,16,53],[17,19,18,30],[17,32,18,53],[20,19,21,30],[20,32,21,53],[28,1,29,4],[28,5,29,14],[28,15,29,26],[28,28,29,31],[28,32,29,41],[28,42,29,53],[30,1,31,4],[30,5,31,14],[30,15,31,26],[30,28,31,31],[30,32,31,41],[30,42,31,53],[32,1,33,4],[32,5,33,14],[32,15,33,26],[32,28,33,31],[32,32,33,41],[32,42,33,53],[34,1,35,4],[34,5,35,14],[34,15,35,26],[34,28,35,31],[34,32,35,41],[34,42,35,53],[36,1,37,4],[36,5,37,14],[36,15,37,26],[36,28,37,31],[36,32,37,41],[36,42,37,53],[38,1,39,4],[38,5,39,14],[38,15,39,26],[38,28,39,31],[38,32,39,41],[38,42,39,53],[40,1,41,4],[40,5,41,14],[40,15,41,26],[40,28,41,31],[40,32,41,41],[40,42,41,53],[42,1,43,4],[42,5,43,14],[42,15,43,26],[42,28,43,31],[42,32,43,41],[42,42,43,53],[44,1,45,4],[44,5,45,14],[44,15,45,26],[44,28,45,31],[44,32,45,41],[44,42,45,53],[46,1,47,4],[46,5,47,14],[46,15,47,26],[46,28,47,31],[46,32,47,41],[46,42,47,53],[48,1,49,4],[48,5,49,14],[48,15,49,26],[48,28,49,31],[48,32,49,41],[48,42,49,53]]}
{"$rows_empty":11}
[{"$nulls":19},"企　業　番　号",{"$nulls":16},{"$f":"IFERROR(INDEX(法人情報!$B$1:$B$8,1),0)","v":0}]
[]
[]
[{"$nulls":19},"所　在　地",{"$nulls":12},{"$f":"IFERROR(INDEX(法人情報!$B$1:$B$8,3)&CHAR(10)&INDEX(法人情報!$B$1:$B$8,4),0)","v":"\n"}]
[]
[]
[{"$nulls":19},"事　業　所　名",{"$nulls":12},{"$f":"IFERROR(INDEX(法人情報!$B$1:$B$8,2),0)","v":0}]
[]
[]
[{"$nulls":19},"代　表　者　名",{"$nulls":12},{"$f":"IFERROR(INDEX(法人情報!$B$1:$B$8,7),0)","v":0}]
{"$rows_empty":7}
[null,"会　員\n番　号",{"$nulls":3},"氏　　名　",{"$nulls":9},"再発行理由",{"$nulls":12},"会　員\n番　号",{"$nulls":3},"氏　　名　",{"$nulls":9},"再発行理由"]
[]
[{"$nulls":5},{"$f":"IFERROR(VLOOKUP($B31,会員情報!$A$2:$BH$1020,3,FALSE),0)","v":0},{"$nulls":26},{"$f":"IFERROR(VLOOKUP($AC31,会員情報!$A$2:$BH$1020,3,FALSE),0)","v":0}]
[]
[{"$nulls":5},{"$f":"IFERROR(VLOOKUP($B33,会員情報!$A$2:$BH$1020,3,FALSE),0)","v":0},{"$nulls":26},{"$f":"IFERROR(VLOOKUP($AC33,会員情報!$A$2:$BH$1020,3,FALSE),0)","v":0}]
[]
[{"$nulls":5},{"$f":"IFERROR(VLOOKUP($B35,会員情報!$A$2:$BH$1020,3,FALSE),0)","v":0},{"$nulls":26},{"$f":"IFERROR(VLOOKUP($AC35,会員情報!$A$2:$BH$1020,3,FALSE),0)","v":0}]
[]
[{"$nulls":5},{"$f":"IFERROR(VLOOKUP($B37,会員情報!$A$2:$BH$1020,3,FALSE),0)","v":0},{"$nulls":26},{"$f":"IFERROR(VLOOKUP($AC37,会員情報!$A$2:$BH$1020,3,FALSE),0)","v":0}]
[]
[{"$nulls":5},{"$f":"IFERROR(VLOOKUP($B39,会員情報!$A$2:$BH$1020,3,FALSE),0)","v":0},{"$nulls":26},{"$f":"IFERROR(VLOOKUP($AC39,会員情報!$A$2:$BH$1020,3,FALSE),0)","v":0}]
[]
[{"$nulls":5},{"$f":"IFERROR(VLOOKUP($B41,会員情報!$A$2:$BH$1020,3,FALSE),0)","v":0},{"$nulls":26},{"$f":"IFERROR(VLOOKUP($AC41,会員情報!$A$2:$BH$1020,3,FALSE),0)","v":0}]
[]
[{"$nulls":5},{"$f":"IFERROR(VLOOKUP($B43,会員情報!$A$2:$BH$1020,3,FALSE),0)","v":0},{"$nulls":26},{"$f":"IFERROR(VLOOKUP($AC43,会員情報!$A$2:$BH$1020,3,FALSE),0)","v":0}]
[]
[{"$nulls":5},{"$f":"IFERROR(VLOOKUP($B45,会員情報!$A$2:$BH$1020,3,FALSE),0)","v":0},{"$nulls":26},{"$f":"IFERROR(VLOOKUP($AC45,会員情報!$A$2:$BH$1020,3,FALSE),0)","v":0}]
[]
{"$rows_left_out":8}